Git Product home page Git Product logo

rapidminer / rapidminer-studio-modular Goto Github PK

View Code? Open in Web Editor NEW
35.0 35.0 7.0 30.8 MB

Easy-to-use visual environment for predictive analytics. No programming required. RapidMiner is easily the most powerful and intuitive graphical user interface for the design of analysis processes. Forget sifting through code! You can also choose to run in batch mode. Whatever you prefer, RapidMiner has it all.

Home Page: https://www.rapidminer.com

License: GNU Affero General Public License v3.0

Java 99.82% HTML 0.11% ANTLR 0.01% XSLT 0.05% CSS 0.01%

rapidminer-studio-modular's People

Contributors

jczogalla avatar

Stargazers

 avatar  avatar  avatar  avatar  avatar  avatar  avatar  avatar  avatar  avatar  avatar  avatar  avatar  avatar  avatar  avatar  avatar  avatar  avatar  avatar  avatar  avatar  avatar  avatar  avatar  avatar  avatar  avatar  avatar  avatar  avatar  avatar  avatar  avatar  avatar

Watchers

 avatar  avatar  avatar  avatar  avatar  avatar

rapidminer-studio-modular's Issues

gradle jar failed on AArch64, Fedora 33

Starting a Gradle Daemon, 1 incompatible and 1 stopped Daemons could not be reused, use --status for details

FAILURE: Build failed with an exception.

  • What went wrong:
    A problem occurred configuring project ':rapidminer-studio-core'.

Could not resolve all artifacts for configuration ':rapidminer-studio-core:classpath'.
Could not resolve com.rapidminer.gradle:java-basics:0.4.0.
Required by:
project :rapidminer-studio-core
> Could not resolve com.rapidminer.gradle:java-basics:0.4.0.
> Could not get resource 'https://jcenter.bintray.com/com/rapidminer/gradle/java-basics/0.4.0/java-basics-0.4.0.pom'.
> Could not GET 'https://jcenter.bintray.com/com/rapidminer/gradle/java-basics/0.4.0/java-basics-0.4.0.pom'.
> jcenter.bintray.com: Name or service not known
> Could not resolve com.rapidminer.gradle:java-basics:0.4.0.
> Could not get resource 'https://maven.rapidminer.com/content/groups/public/com/rapidminer/gradle/java-basics/0.4.0/java-basics-0.4.0.pom'.
> Could not GET 'https://maven.rapidminer.com/content/groups/public/com/rapidminer/gradle/java-basics/0.4.0/java-basics-0.4.0.pom'.
> maven.rapidminer.com
Could not resolve com.rapidminer.gradle:java-publishing:0.2.1.
Required by:
project :rapidminer-studio-core
> Could not resolve com.rapidminer.gradle:java-publishing:0.2.1.
> Could not get resource 'https://jcenter.bintray.com/com/rapidminer/gradle/java-publishing/0.2.1/java-publishing-0.2.1.pom'.
> Could not GET 'https://jcenter.bintray.com/com/rapidminer/gradle/java-publishing/0.2.1/java-publishing-0.2.1.pom'.
> jcenter.bintray.com
> Could not resolve com.rapidminer.gradle:java-publishing:0.2.1.
> Could not get resource 'https://maven.rapidminer.com/content/groups/public/com/rapidminer/gradle/java-publishing/0.2.1/java-publishing-0.2.1.pom'.
> Could not GET 'https://maven.rapidminer.com/content/groups/public/com/rapidminer/gradle/java-publishing/0.2.1/java-publishing-0.2.1.pom'.
> maven.rapidminer.com: Name or service not known

  • Try:
    Run with --stacktrace option to get the stack trace. Run with --info or --debug option to get more log output. Run with --scan to get full insights.

  • Get more help at https://help.gradle.org

BUILD FAILED in 22s

Gradle build error

for building project after cloning it in my pc.
then run command gradlew ja----> throws expception

  • What went wrong:
    A problem occurred evaluating project ':rapidminer-studio-core'.

Could not resolve all artifacts for configuration 'classpath'.
Could not resolve org.ajoberstar.grgit:grgit-core:4.0.2.
Required by:
unspecified:unspecified:unspecified > org.ajoberstar.grgit:grgit-gradle:4.0.2
> Could not resolve org.ajoberstar.grgit:grgit-core:4.0.2.
> Could not get resource 'https://plugins.gradle.org/m2/org/ajoberstar/grgit/grgit-core/4.0.2/grgit-core-4.0.2.pom'.
> Could not GET 'https://jcenter.bintray.com/org/ajoberstar/grgit/grgit-core/4.0.2/grgit-core-4.0.2.pom'. Received status code 403 from server: Forbidden

i comment all props.gradle file to ignore resolving classpath 'org.ajoberstar.grgit:grgit-gradle:4.0.+'

after that again run command gradlew jar
and throws a new nasty exception.....
FAILURE: Build failed with an exception.

  • Where:
    Script 'C:\Users\hedi\Desktop\rapidminer-studio-modular\open-source\os-module.gradle' line: 12

  • What went wrong:
    A problem occurred evaluating script.

Plugin with id 'com.rapidminer.java-basics' not found.

Recommend Projects

  • React photo React

    A declarative, efficient, and flexible JavaScript library for building user interfaces.

  • Vue.js photo Vue.js

    ๐Ÿ–– Vue.js is a progressive, incrementally-adoptable JavaScript framework for building UI on the web.

  • Typescript photo Typescript

    TypeScript is a superset of JavaScript that compiles to clean JavaScript output.

  • TensorFlow photo TensorFlow

    An Open Source Machine Learning Framework for Everyone

  • Django photo Django

    The Web framework for perfectionists with deadlines.

  • D3 photo D3

    Bring data to life with SVG, Canvas and HTML. ๐Ÿ“Š๐Ÿ“ˆ๐ŸŽ‰

Recommend Topics

  • javascript

    JavaScript (JS) is a lightweight interpreted programming language with first-class functions.

  • web

    Some thing interesting about web. New door for the world.

  • server

    A server is a program made to process requests and deliver data to clients.

  • Machine learning

    Machine learning is a way of modeling and interpreting data that allows a piece of software to respond intelligently.

  • Game

    Some thing interesting about game, make everyone happy.

Recommend Org

  • Facebook photo Facebook

    We are working to build community through open source technology. NB: members must have two-factor auth.

  • Microsoft photo Microsoft

    Open source projects and samples from Microsoft.

  • Google photo Google

    Google โค๏ธ Open Source for everyone.

  • D3 photo D3

    Data-Driven Documents codes.